Target
Xaa-Pro dipeptidase
Ligand
BDBM50078400
Substrate
Meas. Tech.
ChEMBL_159885 (CHEMBL856203)
IC50
110000±n/a nM
Citation
 Maggiora, LLOrawski, ATSimmons, WH Apstatin analogue inhibitors of aminopeptidase P, a bradykinin-degrading enzyme. J Med Chem 42:2394-402 (1999)  
Target
Name:
Xaa-Pro dipeptidase
Synonyms:
PEPD PRD
Type:
PROTEIN
Mol. Mass.:
54541.05
Organism:
Homo sapiens (Human)
Description:
ChEMBL_159887
Residue:
493
  
Inhibitor
Name:
BDBM50078400
Synonyms:
1-[1-(3-Amino-2-hydroxy-4-phenyl-butyryl)-4-hydroxy-pyrrolidine-2-carbonyl]-pyrrolidine-2-carboxylic acid (1-carbamoyl-ethyl)-amide | CHEMBL310868
Type:
Small organic molecule
Emp. Form.:
C23H33N5O6
Mol. Mass.:
475.538
SMILES:
C[C@H](NC(=O)[C@@H]1CCCN1C(=O)[C@@H]1CC(O)CN1C(=O)[C@@H](O)[C@H](N)Cc1ccccc1)C(N)=O
: