Target
Cytosol aminopeptidase
Ligand
BDBM50078400
Substrate
Meas. Tech.
ChEMBL_98543 (CHEMBL708591)
IC50
1600±n/a nM
Citation
 Maggiora, LLOrawski, ATSimmons, WH Apstatin analogue inhibitors of aminopeptidase P, a bradykinin-degrading enzyme. J Med Chem 42:2394-402 (1999)  
Target
Name:
Cytosol aminopeptidase
Synonyms:
AMPL_HUMAN LAP3 Leucine aminopeptidase | PEPS
Type:
PROTEIN
Mol. Mass.:
56171.75
Organism:
Homo sapiens (Human)
Description:
ChEMBL_1507539
Residue:
519
  
Inhibitor
Name:
BDBM50078400
Synonyms:
1-[1-(3-Amino-2-hydroxy-4-phenyl-butyryl)-4-hydroxy-pyrrolidine-2-carbonyl]-pyrrolidine-2-carboxylic acid (1-carbamoyl-ethyl)-amide | CHEMBL310868
Type:
Small organic molecule
Emp. Form.:
C23H33N5O6
Mol. Mass.:
475.538
SMILES:
C[C@H](NC(=O)[C@@H]1CCCN1C(=O)[C@@H]1CC(O)CN1C(=O)[C@@H](O)[C@H](N)Cc1ccccc1)C(N)=O
: