Target
60 kDa heat shock protein, mitochondrial
Ligand
BDBM67454
Substrate
Meas. Tech.
ChEMBL_1891106 (CHEMBL4392933)
IC50
23000±n/a nM
Citation
 Stevens, MAbdeen, SSalim, NRay, AMWashburn, AChitre, SSivinski, JPark, YHoang, QQChapman, EJohnson, SM HSP60/10 chaperonin systems are inhibited by a variety of approved drugs, natural products, and known bioactive molecules. Bioorg Med Chem Lett 29:1106-1112 (2019)  
Target
Name:
60 kDa heat shock protein, mitochondrial
Synonyms:
3.6.4.9 60 kDa heat shock protein, mitochondrial CPN60 HSP-60 HSP60/HSP10 Heat shock protein 60 Mitochondrial matrix protein P1 | P60 lymphocyte protein
Type:
PROTEIN
Mol. Mass.:
61050.41
Organism:
Homo sapiens
Description:
ChEMBL_117701
Residue:
573
  
Inhibitor
Name:
BDBM67454
Synonyms:
1,2,4-trihydroxy-9,10-anthraquinone 1,2,4-tris(oxidanyl)anthracene-9,10-dione SMR001306802 hsp90_173 | purpurin
Type:
Small organic molecule
Emp. Form.:
C14H8O5
Mol. Mass.:
256.2103
SMILES:
Oc1cc(O)c2C(=O)c3ccccc3C(=O)c2c1O
: