Target
D(3) dopamine receptor
Ligand
BDBM50525030
Substrate
Meas. Tech.
ChEMBL_1895321 (CHEMBL4397356)
Ki
631±n/a nM
Citation
 Reilly, SWRiad, AAHsieh, CJSahlholm, KJacome, DAGriffin, STaylor, MWeng, CCXu, KKirschner, NLuedtke, RRParry, CMalhotra, SKaranicolas, JMach, RH Leveraging a Low-Affinity Diazaspiro Orthosteric Fragment to Reduce Dopamine D J Med Chem 62:5132-5147 (2019)  
Target
Name:
D(3) dopamine receptor
Synonyms:
DOPAMINE D3 DRD3_HUMAN Dopamine D3 receptor (D3) Dopamine receptor Dopamine receptor D3
Type:
Mol. Mass.:
44243.43
Organism:
Homo sapiens (Human)
Description:
Residue:
400
  
Inhibitor
Name:
BDBM50525030
Synonyms:
CHEMBL4555952
Type:
Small organic molecule
Emp. Form.:
C19H28N4S
Mol. Mass.:
344.517
SMILES:
Cn1c(SCCCN2CCC(C)(C)CC2)nnc1-c1ccccc1
: