Target
D(3) dopamine receptor
Ligand
BDBM50525033
Substrate
Meas. Tech.
ChEMBL_1895321 (CHEMBL4397356)
Ki
101±n/a nM
Citation
 Reilly, SWRiad, AAHsieh, CJSahlholm, KJacome, DAGriffin, STaylor, MWeng, CCXu, KKirschner, NLuedtke, RRParry, CMalhotra, SKaranicolas, JMach, RH Leveraging a Low-Affinity Diazaspiro Orthosteric Fragment to Reduce Dopamine D J Med Chem 62:5132-5147 (2019)  
Target
Name:
D(3) dopamine receptor
Synonyms:
DOPAMINE D3 DRD3_HUMAN Dopamine D3 receptor (D3) Dopamine receptor Dopamine receptor D3
Type:
Mol. Mass.:
44243.43
Organism:
Homo sapiens (Human)
Description:
Residue:
400
  
Inhibitor
Name:
BDBM50525033
Synonyms:
CHEMBL4541692
Type:
Small organic molecule
Emp. Form.:
C32H39N5OS2
Mol. Mass.:
573.815
SMILES:
COc1ccccc1N1CCC2(CCN(CCCSc3nnc(-c4ccc(cc4)-c4ccsc4)n3C)CC2)CC1
: