Target
D(3) dopamine receptor
Ligand
BDBM50525026
Substrate
Meas. Tech.
ChEMBL_1895321 (CHEMBL4397356)
Ki
6647±n/a nM
Citation
 Reilly, SWRiad, AAHsieh, CJSahlholm, KJacome, DAGriffin, STaylor, MWeng, CCXu, KKirschner, NLuedtke, RRParry, CMalhotra, SKaranicolas, JMach, RH Leveraging a Low-Affinity Diazaspiro Orthosteric Fragment to Reduce Dopamine D J Med Chem 62:5132-5147 (2019)  
Target
Name:
D(3) dopamine receptor
Synonyms:
DOPAMINE D3 DRD3_HUMAN Dopamine D3 receptor (D3) Dopamine receptor Dopamine receptor D3
Type:
Mol. Mass.:
44243.43
Organism:
Homo sapiens (Human)
Description:
Residue:
400
  
Inhibitor
Name:
BDBM50525026
Synonyms:
CHEMBL4453955
Type:
Small organic molecule
Emp. Form.:
C19H30N2O
Mol. Mass.:
302.4543
SMILES:
CCCCN1CCC2(CCN(C2)c2ccccc2OC)CC1
: