Target
H2-K region expressed gene 2, rat orthologue
Ligand
BDBM50079844
Substrate
Meas. Tech.
ChEMBL_103873 (CHEMBL712990)
IC50
240±n/a nM
Citation
 Jones, ABActon, JJAdams, ADYuen, WNichols, EASchwartz, CDWicker, LSHermes, JD Tetrapeptide derived inhibitors of complexation of a class II MHC: fully unnatural ligands. Bioorg Med Chem Lett 9:2115-8 (1999)  
Target
Name:
H2-K region expressed gene 2, rat orthologue
Synonyms:
MHC class II | MHC class II region expressed gene KE2, isoform CRA_a
Type:
PROTEIN
Mol. Mass.:
14499.39
Organism:
Rattus norvegicus
Description:
ChEMBL_10342
Residue:
127
  
Inhibitor
Name:
BDBM50079844
Synonyms:
CHEMBL66358 | N-Butyl-N'-{(S)-2-[(R)-3-(3-cyclohexyl-propylamino)-2-oxo-3-propyl-pyrrolidin-1-yl]-pentanoyl}-hydrazinecarboxylic acid ethyl ester
Type:
Small organic molecule
Emp. Form.:
C28H52N4O4
Mol. Mass.:
508.7369
SMILES:
CCCCN(NC(=O)[C@H](CCC)N1CC[C@@](CCC)(NCCCC2CCCCC2)C1=O)C(=O)OCC
: