Target
Gag-Pol polyprotein [489-587]
Ligand
BDBM50080109
Substrate
Meas. Tech.
ChEBML_157695
Ki
0.210000±n/a nM
Citation
 Kaltenbach, RFKlabe, RMCordova, BCSeitz, SP Increased antiviral activity of cyclic urea HIV protease inhibitors by modifying the P1/P1' substituents. Bioorg Med Chem Lett 9:2259-62 (1999)  
Target
Name:
Gag-Pol polyprotein [489-587]
Synonyms:
Human immunodeficiency virus type 1 protease Pol polyprotein | gag-pol
Type:
Enzyme Subunit
Mol. Mass.:
10781.16
Organism:
Human immunodeficiency virus type 1
Description:
P04585[489-587]
Residue:
99
  
Inhibitor
Name:
BDBM50080109
Synonyms:
(4R,5S,6S,7R)-1,3-Bis-(3-amino-1H-indazol-5-ylmethyl)-4,7-bis-(3-tert-butyl-benzyl)-5,6-dihydroxy-[1,3]diazepan-2-one | CHEMBL309865
Type:
Small organic molecule
Emp. Form.:
C43H52N8O3
Mol. Mass.:
728.9248
SMILES:
CC(C)(C)c1cccc(C[C@@H]2[C@H](O)[C@@H](O)[C@@H](Cc3cccc(c3)C(C)(C)C)N(Cc3ccc4[nH]nc(N)c4c3)C(=O)N2Cc2ccc3[nH]nc(N)c3c2)c1
: