Target
Platelet-derived growth factor receptor beta
Ligand
BDBM50363397
Substrate
Meas. Tech.
ChEMBL_1897221 (CHEMBL4399256)
IC50
1.5±n/a nM
Citation
 Abdel-Mohsen, HTOmar, MAEl Kerdawy, AMMahmoud, AEEAli, MMEl Diwani, HI Novel potent substituted 4-amino-2-thiopyrimidines as dual VEGFR-2 and BRAF kinase inhibitors. Eur J Med Chem 179:707-722 (2019)  
Target
Name:
Platelet-derived growth factor receptor beta
Synonyms:
Beta-type platelet-derived growth factor receptor CD140b antigen PDGF Receptor Substrate PDGFR PDGFR-1 PDGFRB PGFRB_HUMAN Platelet-derived growth factor receptor 1 Platelet-derived growth factor receptor beta (PDGFR-beta) Platelet-derived growth factor receptor beta (PDGFRbeta) | VHL/PDGFRB
Type:
Enzyme
Mol. Mass.:
123922.25
Organism:
Homo sapiens (Human)
Description:
P09619
Residue:
1106
  
Inhibitor
Name:
BDBM50363397
Synonyms:
CHEMBL1946170 US10183928, Regorafenib US10227329, Compound Regorafenib US10584114, Compound Regorafenib US11279688, Compound Regorafenib
Type:
Small organic molecule
Emp. Form.:
C21H15ClF4N4O3
Mol. Mass.:
482.815
SMILES:
CNC(=O)c1cc(Oc2ccc(NC(=O)Nc3ccc(Cl)c(c3)C(F)(F)F)c(F)c2)ccn1
: