Target
Nuclear receptor subfamily 1 group I member 3
Ligand
BDBM50525532
Substrate
Meas. Tech.
ChEMBL_1897372 (CHEMBL4399407)
EC50
980±n/a nM
Citation
 Liang, DLi, LLynch, CDiethelm-Varela, BXia, MXue, FWang, H DL5050, a Selective Agonist for the Human Constitutive Androstane Receptor. ACS Med Chem Lett 10:1039-1044 (2019)  
Target
Name:
Nuclear receptor subfamily 1 group I member 3
Synonyms:
CAR NR1I3_HUMAN
Type:
PROTEIN
Mol. Mass.:
39953.17
Organism:
Homo sapiens (Human)
Description:
ChEMBL_1434936
Residue:
352
  
Inhibitor
Name:
BDBM50525532
Synonyms:
CHEMBL4580898
Type:
Small organic molecule
Emp. Form.:
C25H19N3O2
Mol. Mass.:
393.4373
SMILES:
C1C(Cc2ccccc12)O\N=C\c1c(nc2occn12)-c1ccc2ccccc2c1
: