Target
Nuclear receptor subfamily 1 group I member 3
Ligand
BDBM50525533
Substrate
Meas. Tech.
ChEMBL_1897372 (CHEMBL4399407)
EC50
1700±n/a nM
Citation
 Liang, DLi, LLynch, CDiethelm-Varela, BXia, MXue, FWang, H DL5050, a Selective Agonist for the Human Constitutive Androstane Receptor. ACS Med Chem Lett 10:1039-1044 (2019)  
Target
Name:
Nuclear receptor subfamily 1 group I member 3
Synonyms:
CAR NR1I3_HUMAN
Type:
PROTEIN
Mol. Mass.:
39953.17
Organism:
Homo sapiens (Human)
Description:
ChEMBL_1434936
Residue:
352
  
Inhibitor
Name:
BDBM50525533
Synonyms:
CHEMBL4471586
Type:
Small organic molecule
Emp. Form.:
C23H12F5N3O2
Mol. Mass.:
457.3523
SMILES:
Fc1c(F)c(F)c(CO\N=C\c2c(nc3occn23)-c2ccc3ccccc3c2)c(F)c1F
: