Target
Nuclear receptor subfamily 1 group I member 3
Ligand
BDBM50525539
Substrate
Meas. Tech.
ChEMBL_1897372 (CHEMBL4399407)
EC50
590±n/a nM
Citation
 Liang, DLi, LLynch, CDiethelm-Varela, BXia, MXue, FWang, H DL5050, a Selective Agonist for the Human Constitutive Androstane Receptor. ACS Med Chem Lett 10:1039-1044 (2019)  
Target
Name:
Nuclear receptor subfamily 1 group I member 3
Synonyms:
CAR NR1I3_HUMAN
Type:
PROTEIN
Mol. Mass.:
39953.17
Organism:
Homo sapiens (Human)
Description:
ChEMBL_1434936
Residue:
352
  
Inhibitor
Name:
BDBM50525539
Synonyms:
CHEMBL4469650
Type:
Small organic molecule
Emp. Form.:
C22H19Cl2N3OS
Mol. Mass.:
444.377
SMILES:
CC(C)c1ccc(cc1)-c1nc2sccn2c1\C=N\OCc1ccc(Cl)c(Cl)c1
: