Target
Nuclear receptor subfamily 1 group I member 3
Ligand
BDBM50525522
Substrate
Meas. Tech.
ChEMBL_1897372 (CHEMBL4399407)
EC50
840±n/a nM
Citation
 Liang, DLi, LLynch, CDiethelm-Varela, BXia, MXue, FWang, H DL5050, a Selective Agonist for the Human Constitutive Androstane Receptor. ACS Med Chem Lett 10:1039-1044 (2019)  
Target
Name:
Nuclear receptor subfamily 1 group I member 3
Synonyms:
CAR NR1I3_HUMAN
Type:
PROTEIN
Mol. Mass.:
39953.17
Organism:
Homo sapiens (Human)
Description:
ChEMBL_1434936
Residue:
352
  
Inhibitor
Name:
BDBM50525522
Synonyms:
CHEMBL4576432
Type:
Small organic molecule
Emp. Form.:
C23H17N3O2
Mol. Mass.:
367.4
SMILES:
C(O\N=C\c1c(nc2occn12)-c1ccc2ccccc2c1)c1ccccc1
: