Target
Phenylethanolamine N-methyltransferase
Ligand
BDBM13017
Substrate
Meas. Tech.
ChEMBL_152390 (CHEMBL765513)
Ki
560.0±n/a nM
Citation
 Grunewald, GLCaldwell, TMLi, QSlavica, MCriscione, KRBorchardt, RTWang, W Synthesis and biochemical evaluation of 3-fluoromethyl-1,2,3, 4-tetrahydroisoquinolines as selective inhibitors of phenylethanolamine N-methyltransferase versus the alpha(2)-adrenoceptor. J Med Chem 42:3588-601 (1999)  
Target
Name:
Phenylethanolamine N-methyltransferase
Synonyms:
Noradrenaline N-methyltransferase PNMT_BOVIN | PNMTase
Type:
Enzyme
Mol. Mass.:
30916.97
Organism:
Bos taurus (bovine)
Description:
Residue:
283
  
Inhibitor
Name:
BDBM13017
Synonyms:
1,2,3,4-tetrahydroisoquinoline-7-sulfonamide SKF 29661
Type:
Small organic molecule
Emp. Form.:
C9H12N2O2S
Mol. Mass.:
212.269
SMILES:
NS(=O)(=O)c1ccc2CCNCc2c1
: