Target
Kallikrein-8
Ligand
BDBM50525905
Substrate
Meas. Tech.
ChEMBL_1898430 (CHEMBL4400465)
IC50
100±n/a nM
Citation
 Walker, ALDenis, ABingham, RPBouillot, AEdgar, EVFerrie, AHolmes, DSLaroze, ALiddle, JFouchet, MHMoquette, ANassau, PPearce, ACPolyakova, OSmith, KJThomas, PThorpe, JHTrottet, LWang, YHovnanian, A Design and development of a series of borocycles as selective, covalent kallikrein 5 inhibitors. Bioorg Med Chem Lett 29:0 (2019)  
Target
Name:
Kallikrein-8
Synonyms:
KLK8 Kallikrein 8 NP Neuropsin PRSS19 Serine protease TADG-14 Tumor-associated differentially expressed gene 14 protein | hK8
Type:
PROTEIN
Mol. Mass.:
28053.09
Organism:
Homo sapiens (Human)
Description:
ChEMBL_600069
Residue:
260
  
Inhibitor
Name:
BDBM50525905
Synonyms:
CHEMBL4517343
Type:
Small organic molecule
Emp. Form.:
C22H21BCl2N2O3
Mol. Mass.:
443.131
SMILES:
Cl.NC(=N)c1ccc(cc1OCc1cccc(Cl)c1)C1Cc2ccccc2B(O)O1
: