Target
Kallikrein-8
Ligand
BDBM50525897
Substrate
Meas. Tech.
ChEMBL_1898430 (CHEMBL4400465)
IC50
10000±n/a nM
Citation
 Walker, ALDenis, ABingham, RPBouillot, AEdgar, EVFerrie, AHolmes, DSLaroze, ALiddle, JFouchet, MHMoquette, ANassau, PPearce, ACPolyakova, OSmith, KJThomas, PThorpe, JHTrottet, LWang, YHovnanian, A Design and development of a series of borocycles as selective, covalent kallikrein 5 inhibitors. Bioorg Med Chem Lett 29:0 (2019)  
Target
Name:
Kallikrein-8
Synonyms:
KLK8 Kallikrein 8 NP Neuropsin PRSS19 Serine protease TADG-14 Tumor-associated differentially expressed gene 14 protein | hK8
Type:
PROTEIN
Mol. Mass.:
28053.09
Organism:
Homo sapiens (Human)
Description:
ChEMBL_600069
Residue:
260
  
Inhibitor
Name:
BDBM50525897
Synonyms:
CHEMBL4536142
Type:
Small organic molecule
Emp. Form.:
C22H23BClN3O3
Mol. Mass.:
423.7
SMILES:
Cl.Cc1ccc2B(O)OC(Cc3ccc(C(N)=N)c(OCc4cccnc4)c3)c2c1
: