Target
Kallikrein-8
Ligand
BDBM50525913
Substrate
Meas. Tech.
ChEMBL_1898430 (CHEMBL4400465)
IC50
7943±n/a nM
Citation
 Walker, ALDenis, ABingham, RPBouillot, AEdgar, EVFerrie, AHolmes, DSLaroze, ALiddle, JFouchet, MHMoquette, ANassau, PPearce, ACPolyakova, OSmith, KJThomas, PThorpe, JHTrottet, LWang, YHovnanian, A Design and development of a series of borocycles as selective, covalent kallikrein 5 inhibitors. Bioorg Med Chem Lett 29:0 (2019)  
Target
Name:
Kallikrein-8
Synonyms:
KLK8 Kallikrein 8 NP Neuropsin PRSS19 Serine protease TADG-14 Tumor-associated differentially expressed gene 14 protein | hK8
Type:
PROTEIN
Mol. Mass.:
28053.09
Organism:
Homo sapiens (Human)
Description:
ChEMBL_600069
Residue:
260
  
Inhibitor
Name:
BDBM50525913
Synonyms:
CHEMBL4464120
Type:
Small organic molecule
Emp. Form.:
C21H20BClFN3O3
Mol. Mass.:
427.664
SMILES:
Cl.NC(=N)c1ccc(cc1OCc1cccnc1)C1Cc2ccc(F)cc2B(O)O1
: