Target
Fascin
Ligand
BDBM50526231
Substrate
Meas. Tech.
ChEMBL_1899420 (CHEMBL4401535)
IC50
8600±n/a nM
Citation
 Francis, SCroft, DSchüttelkopf, AWParry, CPugliese, ACameron, KClaydon, SDrysdale, MGardner, CGohlke, AGoodwin, GGray, CHKonczal, JMcDonald, LMezna, MPannifer, APaul, NRMachesky, LMcKinnon, HBower, J Structure-based design, synthesis and biological evaluation of a novel series of isoquinolone and pyrazolo[4,3-c]pyridine inhibitors of fascin 1 as potential anti-metastatic agents. Bioorg Med Chem Lett 29:1023-1029 (2019)  
Target
Name:
Fascin
Synonyms:
55 kDa actin-bundling protein FSCN1 HSN Singed-like protein | p55
Type:
Enzyme Catalytic Domain
Mol. Mass.:
54533.89
Organism:
Homo sapiens (human)
Description:
Residue:
493
  
Inhibitor
Name:
BDBM50526231
Synonyms:
CHEMBL4527032
Type:
Small organic molecule
Emp. Form.:
C22H16FN5O2
Mol. Mass.:
401.3931
SMILES:
Cn1cc(NC(=O)c2cn(Cc3ccc(F)c(c3)C#N)c(=O)c3ccccc23)cn1
: