Target
Fascin
Ligand
BDBM50526239
Substrate
Meas. Tech.
ChEMBL_1899436 (CHEMBL4401551)
Kd
92000±n/a nM
Citation
 Francis, SCroft, DSchüttelkopf, AWParry, CPugliese, ACameron, KClaydon, SDrysdale, MGardner, CGohlke, AGoodwin, GGray, CHKonczal, JMcDonald, LMezna, MPannifer, APaul, NRMachesky, LMcKinnon, HBower, J Structure-based design, synthesis and biological evaluation of a novel series of isoquinolone and pyrazolo[4,3-c]pyridine inhibitors of fascin 1 as potential anti-metastatic agents. Bioorg Med Chem Lett 29:1023-1029 (2019)  
Target
Name:
Fascin
Synonyms:
55 kDa actin-bundling protein FSCN1 HSN Singed-like protein | p55
Type:
Enzyme Catalytic Domain
Mol. Mass.:
54533.89
Organism:
Homo sapiens (human)
Description:
Residue:
493
  
Inhibitor
Name:
BDBM50526239
Synonyms:
CHEMBL4592515
Type:
Small organic molecule
Emp. Form.:
C9H9Cl2NO
Mol. Mass.:
218.08
SMILES:
CN(C(C)=O)c1ccc(Cl)cc1Cl
: