Target
Fascin
Ligand
BDBM50526244
Substrate
Meas. Tech.
ChEMBL_1899421 (CHEMBL4401536)
Kd
>500000±n/a nM
Citation
 Francis, SCroft, DSchüttelkopf, AWParry, CPugliese, ACameron, KClaydon, SDrysdale, MGardner, CGohlke, AGoodwin, GGray, CHKonczal, JMcDonald, LMezna, MPannifer, APaul, NRMachesky, LMcKinnon, HBower, J Structure-based design, synthesis and biological evaluation of a novel series of isoquinolone and pyrazolo[4,3-c]pyridine inhibitors of fascin 1 as potential anti-metastatic agents. Bioorg Med Chem Lett 29:1023-1029 (2019)  
Target
Name:
Fascin
Synonyms:
55 kDa actin-bundling protein FSCN1 HSN Singed-like protein | p55
Type:
Enzyme Catalytic Domain
Mol. Mass.:
54533.89
Organism:
Homo sapiens (human)
Description:
Residue:
493
  
Inhibitor
Name:
BDBM50526244
Synonyms:
CHEMBL4537924
Type:
Small organic molecule
Emp. Form.:
C12H8Cl2N4O
Mol. Mass.:
295.124
SMILES:
Clc1ccc(Cn2cnc3[nH]ncc3c2=O)cc1Cl
: