Target
Fascin
Ligand
BDBM50526245
Substrate
Meas. Tech.
ChEMBL_1899421 (CHEMBL4401536)
Kd
1100±n/a nM
Citation
 Francis, SCroft, DSchüttelkopf, AWParry, CPugliese, ACameron, KClaydon, SDrysdale, MGardner, CGohlke, AGoodwin, GGray, CHKonczal, JMcDonald, LMezna, MPannifer, APaul, NRMachesky, LMcKinnon, HBower, J Structure-based design, synthesis and biological evaluation of a novel series of isoquinolone and pyrazolo[4,3-c]pyridine inhibitors of fascin 1 as potential anti-metastatic agents. Bioorg Med Chem Lett 29:1023-1029 (2019)  
Target
Name:
Fascin
Synonyms:
55 kDa actin-bundling protein FSCN1 HSN Singed-like protein | p55
Type:
Enzyme Catalytic Domain
Mol. Mass.:
54533.89
Organism:
Homo sapiens (human)
Description:
Residue:
493
  
Inhibitor
Name:
BDBM50526245
Synonyms:
CHEMBL4470509
Type:
Small organic molecule
Emp. Form.:
C21H18Cl2N6O2
Mol. Mass.:
457.313
SMILES:
CNc1cc2c(cn(Cc3ccc(Cl)c(Cl)c3)c(=O)c2cn1)C(=O)Nc1cnn(C)c1
: