Target
Potassium voltage-gated channel subfamily H member 2
Ligand
BDBM50526225
Substrate
Meas. Tech.
ChEMBL_1899435 (CHEMBL4401550)
IC50
>25000±n/a nM
Citation
 Francis, SCroft, DSchüttelkopf, AWParry, CPugliese, ACameron, KClaydon, SDrysdale, MGardner, CGohlke, AGoodwin, GGray, CHKonczal, JMcDonald, LMezna, MPannifer, APaul, NRMachesky, LMcKinnon, HBower, J Structure-based design, synthesis and biological evaluation of a novel series of isoquinolone and pyrazolo[4,3-c]pyridine inhibitors of fascin 1 as potential anti-metastatic agents. Bioorg Med Chem Lett 29:1023-1029 (2019)  
Target
Name:
Potassium voltage-gated channel subfamily H member 2
Synonyms:
1,3-beta-glucan synthase component GLS2 ERG Eag-related protein 1 Ether-a-go-go-related gene (HERG) Ether-a-go-go-related gene potassium channel 1 Ether-a-go-go-related gene potassium channel 1 (hERG1) Ether-a-go-go-related protein 1 H-ERG KCNH2 Potassium voltage-gated channel subfamily H member 2 (hERG) Voltage-gated potassium channel subunit Kv11.1 hERG Potassium Channel 1 | putative potassium channel subunit
Type:
Multi-pass membrane protein
Mol. Mass.:
126672.65
Organism:
Homo sapiens (Human)
Description:
Q12809
Residue:
1159
  
Inhibitor
Name:
BDBM50526225
Synonyms:
CHEMBL4452711
Type:
Small organic molecule
Emp. Form.:
C24H22Cl2N6O2
Mol. Mass.:
497.376
SMILES:
Clc1ccc(Cn2cc(C(=O)Nc3ccncc3)c3n(ncc3c2=O)C2CCNCC2)cc1Cl
: