Target
Fascin
Ligand
BDBM350100
Substrate
Meas. Tech.
ChEMBL_1899421 (CHEMBL4401536)
Kd
29300±n/a nM
Citation
 Francis, SCroft, DSchüttelkopf, AWParry, CPugliese, ACameron, KClaydon, SDrysdale, MGardner, CGohlke, AGoodwin, GGray, CHKonczal, JMcDonald, LMezna, MPannifer, APaul, NRMachesky, LMcKinnon, HBower, J Structure-based design, synthesis and biological evaluation of a novel series of isoquinolone and pyrazolo[4,3-c]pyridine inhibitors of fascin 1 as potential anti-metastatic agents. Bioorg Med Chem Lett 29:1023-1029 (2019)  
Target
Name:
Fascin
Synonyms:
55 kDa actin-bundling protein FSCN1 HSN Singed-like protein | p55
Type:
Enzyme Catalytic Domain
Mol. Mass.:
54533.89
Organism:
Homo sapiens (human)
Description:
Residue:
493
  
Inhibitor
Name:
BDBM350100
Synonyms:
5-(3,4-dichlorobenzyl)-1- (S,S,-dioxo- tetrahydrothiophen-3-yl)- 1H-pyrazol[3,4- d]pyrimidin-4(5H)-one US10941146, # 1
Type:
Small organic molecule
Emp. Form.:
C16H14Cl2N4O3S
Mol. Mass.:
413.278
SMILES:
Clc1ccc(Cn2cnc3n(ncc3c2=O)C2CCS(=O)(=O)C2)cc1Cl
: