Target
Fascin
Ligand
BDBM50526233
Substrate
Meas. Tech.
ChEMBL_1899420 (CHEMBL4401535)
IC50
>100000±n/a nM
Citation
 Francis, SCroft, DSchüttelkopf, AWParry, CPugliese, ACameron, KClaydon, SDrysdale, MGardner, CGohlke, AGoodwin, GGray, CHKonczal, JMcDonald, LMezna, MPannifer, APaul, NRMachesky, LMcKinnon, HBower, J Structure-based design, synthesis and biological evaluation of a novel series of isoquinolone and pyrazolo[4,3-c]pyridine inhibitors of fascin 1 as potential anti-metastatic agents. Bioorg Med Chem Lett 29:1023-1029 (2019)  
Target
Name:
Fascin
Synonyms:
55 kDa actin-bundling protein FSCN1 HSN Singed-like protein | p55
Type:
Enzyme Catalytic Domain
Mol. Mass.:
54533.89
Organism:
Homo sapiens (human)
Description:
Residue:
493
  
Inhibitor
Name:
BDBM50526233
Synonyms:
CHEMBL4574047
Type:
Small organic molecule
Emp. Form.:
C20H20Cl2N6O2
Mol. Mass.:
447.318
SMILES:
Nc1cc(cn(Cc2ccc(Cl)c(Cl)c2)c1=O)C(=O)Nc1cnn(c1)C1CCNC1
: