Target
Cytochrome P450 2C19
Ligand
BDBM50526225
Substrate
Meas. Tech.
ChEMBL_1899433 (CHEMBL4401548)
IC50
22000±n/a nM
Citation
 Francis, SCroft, DSchüttelkopf, AWParry, CPugliese, ACameron, KClaydon, SDrysdale, MGardner, CGohlke, AGoodwin, GGray, CHKonczal, JMcDonald, LMezna, MPannifer, APaul, NRMachesky, LMcKinnon, HBower, J Structure-based design, synthesis and biological evaluation of a novel series of isoquinolone and pyrazolo[4,3-c]pyridine inhibitors of fascin 1 as potential anti-metastatic agents. Bioorg Med Chem Lett 29:1023-1029 (2019)  
Target
Name:
Cytochrome P450 2C19
Synonyms:
(R)-limonene 6-monooxygenase (S)-limonene 7-monooxygenase CYP2C19 CYPIIC19 Cytochrome P450 2C19 [I331V] Cytochrome P450-254C Mephenytoin 4-hydroxylase P450-254C
Type:
Enzyme
Mol. Mass.:
55935.47
Organism:
Homo sapiens (Human)
Description:
P33261
Residue:
490
  
Inhibitor
Name:
BDBM50526225
Synonyms:
CHEMBL4452711
Type:
Small organic molecule
Emp. Form.:
C24H22Cl2N6O2
Mol. Mass.:
497.376
SMILES:
Clc1ccc(Cn2cc(C(=O)Nc3ccncc3)c3n(ncc3c2=O)C2CCNCC2)cc1Cl
: