Target
Reverse transcriptase/RNaseH
Ligand
BDBM1944
Substrate
Meas. Tech.
ChEMBL_195668 (CHEMBL800663)
IC50
8320±n/a nM
Citation
 Genin, MJPoel, TJMay, PDKopta, LAYagi, YOlmsted, RAFriis, JMVoorman, RLAdams, WJThomas, RCRomero, DL Synthesis and structure-activity relationships of the (alkylamino)piperidine-containing BHAP class of non-nucleoside reverse transcriptase inhibitors: effect of 3-alkylpyridine ring substitution. J Med Chem 42:4140-9 (1999)  
Target
Name:
Reverse transcriptase/RNaseH
Synonyms:
HIV-1 Reverse Transcriptase RNase H Reverse transcriptase/RNaseH
Type:
PROTEIN
Mol. Mass.:
65229.15
Organism:
Human immunodeficiency virus 1
Description:
ChEMBL_1473730
Residue:
566
  
Inhibitor
Name:
BDBM1944
Synonyms:
BHAP deriv. DELAVIRDINE MESYLATE N-[2-({4-[3-(propan-2-ylamino)pyridin-2-yl]piperazin-1-yl}carbonyl)-1H-indol-5-yl]methanesulfonamide U-90152S
Type:
Small organic molecule
Emp. Form.:
C22H28N6O3S
Mol. Mass.:
456.561
SMILES:
CC(C)Nc1cccnc1N1CCN(CC1)C(=O)c1cc2cc(NS(C)(=O)=O)ccc2[nH]1
: