Target
Phenylethanolamine N-methyltransferase
Ligand
BDBM50052884
Substrate
Meas. Tech.
ChEMBL_152399 (CHEMBL764115)
Ki
38000±n/a nM
Citation
 Grunewald, GLCaldwell, TMLi, QDahanukar, VHMcNeil, BCriscione, KR Enantiospecific synthesis of 3-fluoromethyl-, 3-hydroxymethyl-, and 3-chloromethyl-1,2,3,4-tetrahydroisoquinolines as selective inhibitors of phenylethanolamine N-methyltransferase versus the alpha(2)-adrenoceptor. J Med Chem 42:4351-61 (1999)  
Target
Name:
Phenylethanolamine N-methyltransferase
Synonyms:
Noradrenaline N-methyltransferase PNMT_BOVIN | PNMTase
Type:
Enzyme
Mol. Mass.:
30916.97
Organism:
Bos taurus (bovine)
Description:
Residue:
283
  
Inhibitor
Name:
BDBM50052884
Synonyms:
(S)-3-Methyl-1,2,3,4-tetrahydro-isoquinoline | CHEMBL294079
Type:
Small organic molecule
Emp. Form.:
C10H13N
Mol. Mass.:
147.2169
SMILES:
C[C@H]1Cc2ccccc2CN1
: