Target
Transcriptional activator protein LuxR
Ligand
BDBM50527006
Substrate
Meas. Tech.
ChEMBL_1901840 (CHEMBL4404062)
IC50
2000±n/a nM
Citation
 Chbib, C Impact of the structure-activity relationship of AHL analogues on quorum sensing in Gram-negative bacteria. Bioorg Med Chem 28:0 (2020)  
Target
Name:
Transcriptional activator protein LuxR
Synonyms:
LUXR_ALIFS | luxR
Type:
PROTEIN
Mol. Mass.:
28563.86
Organism:
Vibrio fischeri
Description:
ChEMBL_831639
Residue:
250
  
Inhibitor
Name:
BDBM50527006
Synonyms:
CHEMBL16191
Type:
Small organic molecule
Emp. Form.:
C14H14BrNO4
Mol. Mass.:
340.169
SMILES:
Brc1ccc(CC(=O)CC(=O)NC2CCOC2=O)cc1
: