Target
Sarcoplasmic/endoplasmic reticulum calcium ATPase 1
Ligand
BDBM50049391
Substrate
Meas. Tech.
ChEMBL_1902010 (CHEMBL4404232)
IC50
9000±n/a nM
Citation
 Peterková, LKmoní?ková, ERuml, TRimpelová, S Sarco/Endoplasmic Reticulum Calcium ATPase Inhibitors: Beyond Anticancer Perspective. J Med Chem 63:1937-1963 (2020)  
Target
Name:
Sarcoplasmic/endoplasmic reticulum calcium ATPase 1
Synonyms:
AT2A1_RABIT Sarco/endoplasmic Reticulum Ca2+ ATPase 1 | Sarcoplasmic/endoplasmic reticulum calcium ATP-ase
Type:
PROTEIN
Mol. Mass.:
110435.34
Organism:
Oryctolagus cuniculus
Description:
ChEMBL_1500621
Residue:
1001
  
Inhibitor
Name:
BDBM50049391
Synonyms:
3,5,7-Trihydroxyflavone 3,5,7-trihydroxy-2-phenyl-4H-benzopyran-4-one CHEMBL309490 Galangin (15) cid_5281616 | norizalpinin
Type:
Small organic molecule
Emp. Form.:
C15H10O5
Mol. Mass.:
270.2369
SMILES:
Oc1cc(O)c2c(c1)oc(-c1ccccc1)c(O)c2=O
: