Target
ATP-dependent Clp protease proteolytic subunit
Ligand
BDBM50527103
Substrate
Meas. Tech.
ChEMBL_1902128 (CHEMBL4404350)
IC50
14400±n/a nM
Citation
 Ju, YHe, LZhou, YYang, TSun, KSong, RYang, YLi, CSang, ZBao, RLuo, Y Discovery of Novel Peptidomimetic Boronate ClpP Inhibitors with Noncanonical Enzyme Mechanism as Potent Virulence Blockers  J Med Chem 63:3104-3119 (2020)  
Target
Name:
ATP-dependent Clp protease proteolytic subunit
Synonyms:
ATP-dependent Clp protease proteolytic subunit Caseinolytic protease Heat shock protein F21.5 Protease Ti lopP
Type:
PROTEIN
Mol. Mass.:
23183.39
Organism:
Escherichia coli (strain K12)
Description:
ChEMBL_109492
Residue:
207
  
Inhibitor
Name:
BDBM50527103
Synonyms:
CHEMBL4449233
Type:
Small organic molecule
Emp. Form.:
C24H29ClN2O5
Mol. Mass.:
460.95
SMILES:
CC(C)C[C@H](NC(=O)OCc1ccccc1)C(=O)N[C@@H](Cc1ccc(O)cc1)C(=O)CCl
: