Target
Carbonic anhydrase 5B, mitochondrial
Ligand
BDBM50528165
Substrate
Meas. Tech.
ChEMBL_1904505 (CHEMBL4406727)
Ki
13±n/a nM
Citation
 Nocentini, AAlterio, VBua, SMicheli, LEsposito, DBuonanno, MBartolucci, GOsman, SMALOthman, ZACirilli, RPierini, MMonti, SMDi Cesare Mannelli, LGratteri, PGhelardini, CDe Simone, GSupuran, CT Phenyl(thio)phosphon(amid)ate Benzenesulfonamides as Potent and Selective Inhibitors of Human Carbonic Anhydrases II and VII Counteract Allodynia in a Mouse Model of Oxaliplatin-Induced Neuropathy. J Med Chem 63:5185-5200 (2020)  
Target
Name:
Carbonic anhydrase 5B, mitochondrial
Synonyms:
CA-VB CAH5B_HUMAN Carbonic Anhydrase VB Carbonic anhydrase 5B, mitochondrial Carbonic anhydrase V | Carbonic anhydrase VB (CA VB)
Type:
Enzyme
Mol. Mass.:
36440.83
Organism:
Homo sapiens (Human)
Description:
Human (cloned) isozyme
Residue:
317
  
Inhibitor
Name:
BDBM50528165
Synonyms:
CHEMBL4543084
Type:
Small organic molecule
Emp. Form.:
C12H13N2O4PS
Mol. Mass.:
312.281
SMILES:
NP(=O)(Oc1ccc(cc1)S(N)(=O)=O)c1ccccc1
: