Target
Carbonic anhydrase 5B, mitochondrial
Ligand
BDBM50528166
Substrate
Meas. Tech.
ChEMBL_1904505 (CHEMBL4406727)
Ki
19±n/a nM
Citation
 Nocentini, AAlterio, VBua, SMicheli, LEsposito, DBuonanno, MBartolucci, GOsman, SMALOthman, ZACirilli, RPierini, MMonti, SMDi Cesare Mannelli, LGratteri, PGhelardini, CDe Simone, GSupuran, CT Phenyl(thio)phosphon(amid)ate Benzenesulfonamides as Potent and Selective Inhibitors of Human Carbonic Anhydrases II and VII Counteract Allodynia in a Mouse Model of Oxaliplatin-Induced Neuropathy. J Med Chem 63:5185-5200 (2020)  
Target
Name:
Carbonic anhydrase 5B, mitochondrial
Synonyms:
CA-VB CAH5B_HUMAN Carbonic Anhydrase VB Carbonic anhydrase 5B, mitochondrial Carbonic anhydrase V | Carbonic anhydrase VB (CA VB)
Type:
Enzyme
Mol. Mass.:
36440.83
Organism:
Homo sapiens (Human)
Description:
Human (cloned) isozyme
Residue:
317
  
Inhibitor
Name:
BDBM50528166
Synonyms:
CHEMBL4519039
Type:
Small organic molecule
Emp. Form.:
C15H14NO5PS
Mol. Mass.:
351.314
SMILES:
NS(=O)(=O)c1ccc(O[P@@](=O)(OCC#C)c2ccccc2)cc1
: