Target
Cyclin-dependent kinase 2
Ligand
BDBM50528239
Substrate
Meas. Tech.
ChEMBL_1904671 (CHEMBL4407029)
IC50
13±n/a nM
Citation
 Khan, IShareef, MAKumar, CG An overview on the synthetic and medicinal perspectives of indenopyrazoles. Eur J Med Chem 178:1-12 (2019)  
Target
Name:
Cyclin-dependent kinase 2
Synonyms:
CDK2 CDK2_HUMAN Cell division protein kinase 2 Protein cereblon/Cyclin-dependent kinase 2 | p33 protein kinase
Type:
Enzyme Subunit
Mol. Mass.:
33938.17
Organism:
Homo sapiens (Human)
Description:
P24941
Residue:
298
  
Inhibitor
Name:
BDBM50528239
Synonyms:
CHEMBL148580
Type:
Small organic molecule
Emp. Form.:
C24H25N7O3
Mol. Mass.:
459.5004
SMILES:
COc1ccc(cc1)-c1[nH]nc2-c3cccc(NC(=O)CN4CCN(CC4)C(N)=N)c3C(=O)c12
: