Target
Delta-type opioid receptor
Ligand
BDBM50083169
Substrate
Meas. Tech.
ChEMBL_146900 (CHEMBL751113)
Ki
0.066±n/a nM
Citation
 Salvadori, SGuerrini, RBalboni, GBianchi, CBryant, SDCooper, PSLazarus, LH Further studies on the Dmt-Tic pharmacophore: hydrophobic substituents at the C-terminus endow delta antagonists to manifest mu agonism or mu antagonism. J Med Chem 42:5010-9 (2000)  
Target
Name:
Delta-type opioid receptor
Synonyms:
Cytochrome P450 3A4 Delta opioid receptor Delta-type opioid receptor (DOR) OPRD_RAT Opioid receptor Opioid receptors; mu & delta Ror-a | Voltage-gated potassium channel
Type:
G Protein-Coupled Receptor (GPCR)
Mol. Mass.:
40465.04
Organism:
Rattus norvegicus (rat)
Description:
Competition binding assays were using CHO-K1 cell membranes expressing the opioid receptor.
Residue:
372
  
Inhibitor
Name:
BDBM50083169
Synonyms:
(S)-2-[(S)-2-Amino-3-(4-hydroxy-2,6-dimethyl-phenyl)-propionyl]-1,2,3,4-tetrahydro-isoquinoline-3-carboxylic acid ((S)-1-tert-butylcarbamoyl-ethyl)-amide | CHEMBL344106
Type:
Small organic molecule
Emp. Form.:
C28H38N4O4
Mol. Mass.:
494.6257
SMILES:
C[C@H](NC(=O)[C@@H]1Cc2ccccc2CN1C(=O)[C@@H](N)Cc1c(C)cc(O)cc1C)C(=O)NC(C)(C)C
: