Target
Integrin alpha-IIb/beta-3
Ligand
BDBM50083814
Substrate
Meas. Tech.
ChEMBL_70368 (CHEMBL677193)
IC50
66±n/a nM
Citation
 Batt, DGPetraitis, JJHoughton, GCModi, DPCain, GACorjay, MHMousa, SABouchard, PJForsythe, MSHarlow, PPBarbera, FASpitz, SMWexler, RRJadhav, PK Disubstituted indazoles as potent antagonists of the integrin alpha(v)beta(3). J Med Chem 43:41-58 (2000)  
Target
Name:
Integrin alpha-IIb/beta-3
Synonyms:
Glycoprotein IIb/IIIa
Type:
Mol. Mass.:
Description:
ASSAY_ID of EBI is 30109
Components:
This complex has 2 components.
Component 1
Name:
Integrin beta-3
Synonyms:
CD_antigen=CD61 GPIIIa ITGB3 Platelet membrane glycoprotein IIIa
Type:
Protein
Mol. Mass.:
87038.91
Organism:
Homo sapiens (Human)
Description:
P05106
Residue:
788
  
Component 2
Name:
Integrin alpha-IIb
Synonyms:
CD_antigen=CD41 GPIIb Glycoprotein IIb ITGA2B Integrin alpha-IIb heavy chain Integrin alpha-IIb light chain, form 2 Integrin alpha-V/beta-3 and alpha-IIb/beta 3 | Platelet membrane glycoprotein IIb
Type:
Protein
Mol. Mass.:
113354.85
Organism:
Homo sapiens (Human)
Description:
P08514
Residue:
1039
  
Inhibitor
Name:
BDBM50083814
Synonyms:
3-({1-[3-(1,4,5,6-Tetrahydro-pyrimidin-2-ylamino)-propyl]-1H-indazole-5-carbonyl}-amino)-2-(2,4,6-trimethyl-benzenesulfonylamino)-propionic acid | CHEMBL346064
Type:
Small organic molecule
Emp. Form.:
C27H35N7O5S
Mol. Mass.:
569.676
SMILES:
Cc1cc(C)c(c(C)c1)S(=O)(=O)N[C@@H](CNC(=O)c1ccc2n(CCCNC3=NCCCN3)ncc2c1)C(O)=O
: