Target
5-hydroxytryptamine receptor 1A
Ligand
BDBM50084485
Substrate
Meas. Tech.
ChEMBL_3540 (CHEMBL619207)
Ki
105±n/a nM
Citation
 Perrone, RBerardi, FColabufo, NALeopoldo, MTortorella, V A structure-affinity relationship study on derivatives of N-[2-[4-(4-Chlorophenyl)piperazin-1-yl]ethyl]-3-methoxybenzamide, a high-affinity and selective D(4) receptor ligand. J Med Chem 43:270-7 (2000)  
Target
Name:
5-hydroxytryptamine receptor 1A
Synonyms:
5-HT-1A 5-HT1A 5-hydroxytryptamine receptor 1A (5HT1A) 5ht1a Htr1a Serotonin 1a (5-HT1a) receptor/Adrenergic receptor alpha-1 | Serotonin receptor 1A
Type:
G Protein-Coupled Receptor (GPCR)
Mol. Mass.:
46445.29
Organism:
Rattus norvegicus (rat)
Description:
Binding assays were performed using rat hippocampal membranes.
Residue:
422
  
Inhibitor
Name:
BDBM50084485
Synonyms:
1-(4-Chloro-phenyl)-4-[3-(5-methoxy-1,2,3,4-tetrahydro-naphthalen-1-yl)-propyl]-piperazine (2HCL) | CHEMBL321557
Type:
Small organic molecule
Emp. Form.:
C24H31ClN2O
Mol. Mass.:
398.969
SMILES:
COc1cccc2C(CCCN3CCN(CC3)c3ccc(Cl)cc3)CCCc12
: