Target
D(4) dopamine receptor
Ligand
BDBM50084485
Substrate
Meas. Tech.
ChEMBL_61324 (CHEMBL670099)
Ki
416.0±n/a nM
Citation
 Perrone, RBerardi, FColabufo, NALeopoldo, MTortorella, V A structure-affinity relationship study on derivatives of N-[2-[4-(4-Chlorophenyl)piperazin-1-yl]ethyl]-3-methoxybenzamide, a high-affinity and selective D(4) receptor ligand. J Med Chem 43:270-7 (2000)  
Target
Name:
D(4) dopamine receptor
Synonyms:
D(2C) dopamine receptor DOPAMINE D4.2 DRD4 Dopamine D4 receptor
Type:
Enzyme
Mol. Mass.:
48373.19
Organism:
Homo sapiens (Human)
Description:
P21917
Residue:
419
  
Inhibitor
Name:
BDBM50084485
Synonyms:
1-(4-Chloro-phenyl)-4-[3-(5-methoxy-1,2,3,4-tetrahydro-naphthalen-1-yl)-propyl]-piperazine (2HCL) | CHEMBL321557
Type:
Small organic molecule
Emp. Form.:
C24H31ClN2O
Mol. Mass.:
398.969
SMILES:
COc1cccc2C(CCCN3CCN(CC3)c3ccc(Cl)cc3)CCCc12
: