Target
Carbonic anhydrase 1
Ligand
BDBM50080728
Substrate
Meas. Tech.
ChEMBL_47511 (CHEMBL657821)
Ki
44±n/a nM
Citation
 Scozzafava, ABriganti, FIlies, MASupuran, CT Carbonic anhydrase inhibitors: synthesis of membrane-impermeant low molecular weight sulfonamides possessing in vivo selectivity for the membrane-bound versus cytosolic isozymes. J Med Chem 43:292-300 (2000)  
Target
Name:
Carbonic anhydrase 1
Synonyms:
CA-I CAB Carbonate dehydratase I Carbonic anhydrase 1 (CA I) Carbonic anhydrase 1 (Recombinant CA I) Carbonic anhydrase B Carbonic anhydrase I (CA I) Carbonic anhydrase I (CAI) Carbonic anhydrase isoenzyme I (hCA I) | hCA
Type:
Enzyme
Mol. Mass.:
28873.37
Organism:
Homo sapiens (Human)
Description:
P00915
Residue:
261
  
Inhibitor
Name:
BDBM50080728
Synonyms:
3-{[(4-aminophenyl)sulfonyl]amino}benzenesulfonamide 4-amino-bis-benzenesulfonamide | CHEMBL14182
Type:
Small organic molecule
Emp. Form.:
C12H13N3O4S2
Mol. Mass.:
327.379
SMILES:
Nc1ccc(cc1)S(=O)(=O)Nc1cccc(c1)S(N)(=O)=O
: