Target
Androgen receptor
Ligand
BDBM50094975
Substrate
Meas. Tech.
ChEMBL_1909469 (CHEMBL4411915)
Ki
1452±n/a nM
Citation
 Hwang, DJHe, YPonnusamy, SMohler, MLThiyagarajan, TMcEwan, IJNarayanan, RMiller, DD New Generation of Selective Androgen Receptor Degraders: Our Initial Design, Synthesis, and Biological Evaluation of New Compounds with Enzalutamide-Resistant Prostate Cancer Activity. J Med Chem 62:491-511 (2019)  
Target
Name:
Androgen receptor
Synonyms:
ANDR_HUMAN Androgen Receptor Androgen receptor/Baculoviral IAP repeat-containing protein 2 Dihydrotestosterone receptor Nuclear receptor subfamily 3 group C member 4
Type:
Receptor
Mol. Mass.:
99185.27
Organism:
Homo sapiens (Human)
Description:
CHO cells were stably transfected with human AR gene.
Residue:
920
  
Inhibitor
Name:
BDBM50094975
Synonyms:
956104-40-8 JNJ-56021927 apalutamide
Type:
Small organic molecule
Emp. Form.:
C21H15F4N5O2S
Mol. Mass.:
477.435
SMILES:
CNC(=O)c1ccc(cc1F)N1C(=S)N(C(=O)C11CCC1)c1cnc(C#N)c(c1)C(F)(F)F
: