Target
Midkine
Ligand
BDBM50529728
Substrate
Meas. Tech.
ChEMBL_1909742 (CHEMBL4412188)
Kd
52±n/a nM
Citation
 Yao, WChen, MDou, XJin, HZhang, XZhu, YSha, MLiu, ZMeng, XZhang, LZhu, SLi, Z Unravel a neuroactive sHA sulfation pattern with neurogenesis activity by a library of defined oligosaccharides. Eur J Med Chem 163:583-596 (2019)  
Target
Name:
Midkine
Synonyms:
ARAP MDK MK1 Midgestation and kidney protein Neurite outgrowth-promoting factor 2 | Neurite outgrowth-promoting protein
Type:
PROTEIN
Mol. Mass.:
15605.71
Organism:
Homo sapiens (Human)
Description:
ChEMBL_805023
Residue:
143
  
Inhibitor
Name:
BDBM50529728
Synonyms:
CHEMBL4540967
Type:
Small organic molecule
Emp. Form.:
C34H55N5O29S2
Mol. Mass.:
1061.947
SMILES:
[H][C@]1(O[C@@H]2O[C@H](C(O)=O)[C@@]([H])(O[C@@H]3O[C@H](COS(O)(=O)=O)[C@@H](O)[C@]([H])(O[C@@H]4O[C@@H]([C@@H](O)[C@H](O)[C@H]4O)C(O)=O)[C@H]3NC(C)=O)[C@H](O)[C@H]2O)[C@H](O)[C@@H](COS(O)(=O)=O)O[C@@H](OCCCCCCN=[N+]=[N-])[C@@H]1NC(C)=O
: