Target
85/88 kDa calcium-independent phospholipase A2
Ligand
BDBM50371970
Substrate
Meas. Tech.
ChEMBL_1910997 (CHEMBL4413443)
IC50
67±n/a nM
Citation
 Mouchlis, VDArmando, ADennis, EA Substrate-Specific Inhibition Constants for Phospholipase A J Med Chem 62:1999-2007 (2019)  
Target
Name:
85/88 kDa calcium-independent phospholipase A2
Synonyms:
Calcium-independent phospholipase A2 PLPL9_HUMAN | PLPLA9
Type:
PROTEIN
Mol. Mass.:
89913.62
Organism:
Homo sapiens (Human)
Description:
ChEMBL_156048
Residue:
806
  
Inhibitor
Name:
BDBM50371970
Synonyms:
CHEMBL89506
Type:
Small organic molecule
Emp. Form.:
C11H19F3OS
Mol. Mass.:
256.328
SMILES:
CCCCCCCCSCC(=O)C(F)(F)F
: