Target
Trypsin
Ligand
BDBM50085359
Substrate
Meas. Tech.
ChEBML_213023
IC50
>1000000±n/a nM
Citation
 Hayashi, YIijima, KKatada, JKiso, Y Structure-activity relationship studies of chloromethyl ketone derivatives for selective human chymase inhibitors. Bioorg Med Chem Lett 10:199-201 (2000)  
Target
Name:
Trypsin
Synonyms:
TRYP_PIG
Type:
PROTEIN
Mol. Mass.:
24411.24
Organism:
Sus scrofa
Description:
ChEMBL_1450738
Residue:
231
  
Inhibitor
Name:
BDBM50085359
Synonyms:
CHEMBL60241 | N-((S)-1-Benzyl-3-chloro-2-oxo-propyl)-3-(4-fluoro-phenyl)-propionamide
Type:
Small organic molecule
Emp. Form.:
C19H19ClFNO2
Mol. Mass.:
347.811
SMILES:
Fc1ccc(CCC(=O)N[C@@H](Cc2ccccc2)C(=O)CCl)cc1
: