Target
Integrase
Ligand
BDBM50085429
Substrate
Meas. Tech.
ChEBML_90573
IC50
3000±n/a nM
Citation
 Singh, SBFelock, PHazuda, DJ Chemical and enzymatic modifications of integric acid and HIV-1 integrase inhibitory activity. Bioorg Med Chem Lett 10:235-8 (2000)  
Target
Name:
Integrase
Synonyms:
Human immunodeficiency virus type 1 integrase
Type:
PROTEIN
Mol. Mass.:
32231.48
Organism:
Human immunodeficiency virus 1
Description:
ChEMBL_90865
Residue:
288
  
Inhibitor
Name:
BDBM50085429
Synonyms:
(R)-2,4-Dimethyl-oct-2-enoic acid (1S,5S,8aR)-6-((E)-1-formyl-vinyl)-4-((S)-1-methoxycarbonyl-3-methyl-butylcarbamoyl)-4a-methyl-7-oxo-1,2,3,4,4a,5,6,7-octahydro-naphthalen-1-yl ester | CHEMBL80568
Type:
Small organic molecule
Emp. Form.:
C32H47NO7
Mol. Mass.:
557.7181
SMILES:
CCCCC(C)\C=C(/C)C(=O)O[C@@H]1CC[C@H](C(=O)N[C@@H](CC(C)C)C(=O)OC)[C@@]2(C)CC(=C(C)C=O)C(=O)C=C12
: