Target
Integrase
Ligand
BDBM50085435
Substrate
Meas. Tech.
ChEBML_90573
IC50
5000±n/a nM
Citation
 Singh, SBFelock, PHazuda, DJ Chemical and enzymatic modifications of integric acid and HIV-1 integrase inhibitory activity. Bioorg Med Chem Lett 10:235-8 (2000)  
Target
Name:
Integrase
Synonyms:
Human immunodeficiency virus type 1 integrase
Type:
PROTEIN
Mol. Mass.:
32231.48
Organism:
Human immunodeficiency virus 1
Description:
ChEMBL_90865
Residue:
288
  
Inhibitor
Name:
BDBM50085435
Synonyms:
CHEMBL80419 | Integric acid derivative
Type:
Small organic molecule
Emp. Form.:
C34H43NO8
Mol. Mass.:
593.7071
SMILES:
CCCCC(C)\C=C(/C)C(=O)O[C@@H]1CC[C@H](C(=O)ON[C@@H](C(=O)OC)c2ccccc2)[C@@]2(C)CC(=C(C)C=O)C(=O)C=C12
: