Target
Tyrosine-protein kinase ABL1
Ligand
BDBM50530295
Substrate
Meas. Tech.
ChEMBL_1911688 (CHEMBL4414134)
IC50
32±n/a nM
Citation
 Simpson, GLBertrand, SMBorthwick, JACampobasso, NChabanet, JChen, SCoggins, JCottom, JChristensen, SBDawson, HCEvans, HLHobbs, ANHong, XMangatt, BMunoz-Muriedas, JOliff, AQin, DScott-Stevens, PWard, PWashio, YYang, JYoung, RJ Identification and Optimization of Novel Small c-Abl Kinase Activators Using Fragment and HTS Methodologies. J Med Chem 62:2154-2171 (2019)  
Target
Name:
Tyrosine-protein kinase ABL1
Synonyms:
ABL ABL1_HUMAN JTK7 Proto-oncogene tyrosine-protein kinase ABL1 Tyrosine-protein kinase ABL V-abl Abelson murine leukemia viral oncogene homolog 1 p150 | tyrosine-protein kinase ABL1 isoform a
Type:
Enzyme
Mol. Mass.:
122897.30
Organism:
Homo sapiens (Human)
Description:
P00519
Residue:
1130
  
Inhibitor
Name:
BDBM50530295
Synonyms:
CHEMBL4453927
Type:
Small organic molecule
Emp. Form.:
C14H9Cl2N5O3S
Mol. Mass.:
398.224
SMILES:
Cn1ncc(c1C(=O)Nc1nc(cs1)-c1ccc(Cl)c(Cl)c1)[N+]([O-])=O
: