Target
Glutamate receptor ionotropic, NMDA 2B
Ligand
BDBM50086387
Substrate
Meas. Tech.
ChEBML_143319
IC50
35±n/a nM
Citation
 Gregory, TFWright, JLWise, LDMeltzer, LTSerpa, KAKonkoy, CSWhittemore, ERWoodward, RM Parallel synthesis of a series of subtype-selective NMDA receptor antagonists. Bioorg Med Chem Lett 10:527-9 (2000)  
Target
Name:
Glutamate receptor ionotropic, NMDA 2B
Synonyms:
GRIN2B Glutamate [NMDA] receptor subunit epsilon 2 N-methyl D-aspartate receptor subtype 2B NMDAR2B NR3 | hNR3
Type:
PROTEIN
Mol. Mass.:
166375.46
Organism:
Homo sapiens (Human)
Description:
ChEMBL_1438829
Residue:
1484
  
Inhibitor
Name:
BDBM50086387
Synonyms:
5-[2-(4-Benzyl-piperidin-1-yl)-ethylsulfanyl]-1H-[1,2,4]triazol-3-ylamine | CHEMBL151901
Type:
Small organic molecule
Emp. Form.:
C16H23N5S
Mol. Mass.:
317.452
SMILES:
Nc1nnc(SCCN2CCC(Cc3ccccc3)CC2)[nH]1
: