Target
Glutamate receptor ionotropic, NMDA 2A
Ligand
BDBM50086387
Substrate
Meas. Tech.
ChEBML_143310
IC50
>100000±n/a nM
Citation
 Gregory, TFWright, JLWise, LDMeltzer, LTSerpa, KAKonkoy, CSWhittemore, ERWoodward, RM Parallel synthesis of a series of subtype-selective NMDA receptor antagonists. Bioorg Med Chem Lett 10:527-9 (2000)  
Target
Name:
Glutamate receptor ionotropic, NMDA 2A
Synonyms:
GRIN2A Glutamate [NMDA] receptor Glutamate [NMDA] receptor subunit epsilon-1 NMDA receptor subtype 2A protein (NR2A) NMDE1_HUMAN hNR2A
Type:
Mol. Mass.:
165293.76
Organism:
Homo sapiens (Human)
Description:
Residue:
1464
  
Inhibitor
Name:
BDBM50086387
Synonyms:
5-[2-(4-Benzyl-piperidin-1-yl)-ethylsulfanyl]-1H-[1,2,4]triazol-3-ylamine | CHEMBL151901
Type:
Small organic molecule
Emp. Form.:
C16H23N5S
Mol. Mass.:
317.452
SMILES:
Nc1nnc(SCCN2CCC(Cc3ccccc3)CC2)[nH]1
: