Target
Phosphatidylinositol 4,5-bisphosphate 3-kinase catalytic subunit gamma isoform
Ligand
BDBM50530887
Substrate
Meas. Tech.
ChEMBL_1914104 (CHEMBL4416687)
IC50
7.9±n/a nM
Citation
 Barnes, LBlaber, HBrooks, DTKByers, LBuckley, DByron, ZCChilvers, RGCochrane, LCooney, EDamian, HAFrancis, LFu He, DGrace, JMJGreen, HJHogarth, EJPJusu, LKillalea, CEKing, OLambert, JLee, ZJLima, NSLong, CLMackinnon, MLMahdy, SMatthews-Wright, JMillward, MJMeehan, MFMerrett, CMorrison, LParke, HRIPayne, CPayne, LPike, CSeal, ASenior, AJSmith, KMStanelyte, KStillibrand, JSzpara, RTaday, FFHThreadgould, AMTrainor, RJWaters, JWilliams, OWong, CKWWood, KBarton, NGruszka, AHenley, ZRowedder, JECookson, RJones, KLNadin, ASmith, IEMacdonald, SJFNortcliffe, A Free-Wilson Analysis of Comprehensive Data on Phosphoinositide-3-kinase (PI3K) Inhibitors Reveals Importance of  J Med Chem 62:10402-10422 (2019)  
Target
Name:
Phosphatidylinositol 4,5-bisphosphate 3-kinase catalytic subunit gamma isoform
Synonyms:
PI3-kinase p110 subunit gamma PI3Kgamma PK3CG_HUMAN Phosphatidylinositol 4,5-bisphosphate 3-kinase (PI3K) Phosphatidylinositol 4,5-bisphosphate 3-kinase catalytic subunit gamma (PI3Kgamma) Phosphatidylinositol 4,5-bisphosphate 3-kinase catalytic subunit gamma isoform (PI3K) Phosphatidylinositol-4,5-bisphosphate 3-kinase catalytic subunit gamma isoform Phosphoinositide 3-kinases gamma (PI3K gamma) p120-PI3K
Type:
Enzyme Subunit
Mol. Mass.:
126470.30
Organism:
Homo sapiens (Human)
Description:
P48736
Residue:
1102
  
Inhibitor
Name:
BDBM50530887
Synonyms:
CHEMBL4538734
Type:
Small organic molecule
Emp. Form.:
C23H30N8O3S
Mol. Mass.:
498.601
SMILES:
COCC(=O)N(C)C1CCN(Cc2cc3nc(nc(N4CCOCC4)c3s2)-c2cnc(N)nc2)C1
: