Target
Phosphatidylinositol 4,5-bisphosphate 3-kinase catalytic subunit delta isoform
Ligand
BDBM50530905
Substrate
Meas. Tech.
ChEMBL_1914102 (CHEMBL4416685)
IC50
7.9±n/a nM
Citation
 Barnes, LBlaber, HBrooks, DTKByers, LBuckley, DByron, ZCChilvers, RGCochrane, LCooney, EDamian, HAFrancis, LFu He, DGrace, JMJGreen, HJHogarth, EJPJusu, LKillalea, CEKing, OLambert, JLee, ZJLima, NSLong, CLMackinnon, MLMahdy, SMatthews-Wright, JMillward, MJMeehan, MFMerrett, CMorrison, LParke, HRIPayne, CPayne, LPike, CSeal, ASenior, AJSmith, KMStanelyte, KStillibrand, JSzpara, RTaday, FFHThreadgould, AMTrainor, RJWaters, JWilliams, OWong, CKWWood, KBarton, NGruszka, AHenley, ZRowedder, JECookson, RJones, KLNadin, ASmith, IEMacdonald, SJFNortcliffe, A Free-Wilson Analysis of Comprehensive Data on Phosphoinositide-3-kinase (PI3K) Inhibitors Reveals Importance of  J Med Chem 62:10402-10422 (2019)  
Target
Name:
Phosphatidylinositol 4,5-bisphosphate 3-kinase catalytic subunit delta isoform
Synonyms:
PI3-kinase p110 subunit delta PI3-kinase subunit p110-delta PIK3CD Phosphatidylinositol 4,5-biphosphate 3-kinase catalytic subunit delta (PIK3CD) Phosphatidylinositol 4,5-bisphosphate 3-kinase 110 kDa catalytic subunit delta (PI3K delta) Phosphatidylinositol 4,5-bisphosphate 3-kinase catalytic subunit delta (PI3Kdelta) Phosphatidylinositol 4,5-bisphosphate 3-kinase catalytic subunit delta isoform (PI3K delta) Phosphatidylinositol 4,5-bisphosphate 3-kinase catalytic subunit delta isoform (PI3K-delta) Phosphatidylinositol 4,5-bisphosphate 3-kinase catalytic subunit delta isoform (PI3Kdelta)
Type:
Enzyme Subunit
Mol. Mass.:
119489.41
Organism:
Homo sapiens (Human)
Description:
O00329
Residue:
1044
  
Inhibitor
Name:
BDBM50530905
Synonyms:
CHEMBL4453879
Type:
Small organic molecule
Emp. Form.:
C22H30N8O3S2
Mol. Mass.:
518.655
SMILES:
CN(C1CCN(Cc2cc3nc(nc(N4CCOCC4)c3s2)-c2cnc(N)nc2)CC1)S(C)(=O)=O
: