Target
Mitogen-activated protein kinase 3
Ligand
BDBM50531646
Substrate
Meas. Tech.
ChEMBL_1920554 (CHEMBL4423399)
IC50
21±n/a nM
Citation
 Ji, DZhang, LZhu, QBai, YWu, YXu, Y Discovery of potent, orally bioavailable ERK1/2 inhibitors with isoindolin-1-one structure by structure-based drug design. Eur J Med Chem 164:334-341 (2019)  
Target
Name:
Mitogen-activated protein kinase 3
Synonyms:
ERK1 Extracellular signal-regulated kinase 1 MAP kinase ERK1 MAPK3/MAPK7 Mitogen-activated protein kinase PRKM3
Type:
Protein
Mol. Mass.:
43136.58
Organism:
Homo sapiens (Human)
Description:
curated by PDB 4QTB
Residue:
379
  
Inhibitor
Name:
BDBM50531646
Synonyms:
CHEMBL4476178
Type:
Small organic molecule
Emp. Form.:
C23H19ClN6O
Mol. Mass.:
430.89
SMILES:
Cn1cc(Nc2nccc(n2)-c2ccc3CN(Cc4cccc(Cl)c4)C(=O)c3c2)cn1
: